zigbee-herdsman
    Preparing search index...
    Index

    Enumeration Members

    APS_DUPLICATE_ENTRY

    APS_DUPLICATE_ENTRY: 184
    APS_FAIL: 177
    APS_ILLEGAL_REQUEST: 179
    APS_INVALID_BINDING: 180
    APS_NO_ACK: 183
    APS_NO_BOUND_DEVICE: 185
    APS_NOT_ALLOWED: 186
    APS_NOT_AUTHENTICATED: 187
    APS_NOT_SUPPORTED: 182
    APS_TABLE_FULL: 178
    APS_UNSUPPORTED_ATTRIB: 181
    BUFFER_FULL: 17
    FAILURE: 1
    INVALID_PARAM: 2
    MAC_ACK_PENDING: 27
    MAC_BAD_STATE: 25
    MAC_BEACON_LOSS: 224
    MAC_CHANNEL_ACCESS_FAILURE: 225
    MAC_DENIED: 226
    MAC_DISABLE_TRX_FAILURE: 227
    MAC_FAILED_SECURITY_CHECK: 228
    MAC_FRAME_TOO_LONG: 229
    MAC_INVALID_GTS: 230
    MAC_INVALID_HANDLE: 231
    MAC_INVALID_PARAMETER: 232
    MAC_MEM_ERROR: 19
    MAC_NO_ACK: 233
    MAC_NO_BEACON: 234
    MAC_NO_DATA: 235
    MAC_NO_RESOURCES: 26
    MAC_NO_SHORT_ADDR: 236
    MAC_NO_TIME: 28
    MAC_ON_TIME_TOO_LING: 246
    MAC_OUT_OF_CAP: 237
    MAC_PANID_CONFLICT: 238
    MAC_PAST_TIME: 247
    MAC_REALIGNMENT: 239
    MAC_SCAN_IN_PROGRESS: 252
    MAC_SRC_MATCH_INVALID_INDEX: 255
    MAC_TRACKING_OFF: 248
    MAC_TRANSACTION_EXPIRED: 240
    MAC_TRANSACTION_OVERFLOW: 241
    MAC_TX_ABORTED: 29
    MAC_TX_ACTIVE: 242
    MAC_UNAVAILABLE_KEY: 243
    MAC_UNSUPPORTED: 245
    MAC_UNSUPPORTED_ATTRIBUTE: 244
    MAC_UNSUPPORTED_NOT_SPOORT: 24
    MALFORMED_CMD: 128
    MEM_ERROR: 16
    NOT_AUTHORIZED: 126
    NV_BAD_ITEM_LEN: 12
    NV_ITEM_INITIALIZED: 9
    NV_OPER_FAILED: 10
    NWK_ALREADY_PRESENT: 197
    NWK_INVALID_PARAM: 193
    NWK_INVALID_REQUEST: 194
    NWK_LEAVE_UNCONFIRMED: 203
    NWK_NO_ACK: 204
    NWK_NO_NETWORKS: 202
    NWK_NO_ROUTE: 205
    NWK_NOT_PERMITTED: 195
    NWK_STARTUP_FAILURE: 196
    NWK_SYNC_FAILURE: 198
    NWK_TABLE_FULL: 199
    NWK_UNKNOWN_DEVICE: 200
    NWK_UNSUPPORTED_ATTRIBUTE: 201
    OTA_ABORT: 149
    OTA_IMAGE_INVALID: 150
    OTA_NO_IMAGE_AVAILABLE: 152
    OTA_REQUIRE_MORE_IMAGE: 153
    OTA_WAIT_FOR_DATA: 151
    SAPI_IN_PROGRESS: 32
    SAPI_INIT: 34
    SAPI_TIMEOUT: 33
    SEC_CCM_FAIL: 164
    SEC_MAX_FRM_COUNT: 163
    SEC_NO_KEY: 161
    SEC_OLD_FRM_COUNT: 162
    SUCCESS: 0
    UNSUP_CLUSTER_CMD: 129
    UNSUPPORTED_MODE: 18